Moderator
type: Concept
definition: Bezeichnet ein Merkmal, dass sich auf den Zusammenhang zwischen zwei anderen Merkmalen auswirkt (z.B. wenn sich körperlicher Fitness auf den Zusammenhang von Alter und Zufriedenheit auswirkt). @de
created: 2022-10-01
top concept of: Klarsaurus
in scheme: Klarsaurus

Klarsaurus
type: ConceptScheme
has top concept: Moderator