Moderation
type: Concept
definition: Bezeichnet den Einfluss, den ein Merkmal auf den Zusammenhang zwischen zwei anderen Merkmalen hat (z.B. den Einfluss von körperlicher Fitness auf den Zusammenhang von Alter und Zufriedenheit). @de
created: 2022-10-01
top concept of: Klarsaurus
in scheme: Klarsaurus

Klarsaurus
type: ConceptScheme
has top concept: Moderation