Coping
type: Concept
definition: Art und Weise, wie Menschen Situationen und Probleme bewältigen
created: 2023-03-01
alternative label: Problembewältigung
alternative label: Bewältigungsverhalten
top concept of: Klarsaurus
in scheme: Klarsaurus

Klarsaurus
type: ConceptScheme
has top concept: Coping