Bindungsverhalten
type: Concept
definition: Beobachtbares Verhalten, das Menschen im Kontakt mit wichtigen Bezugspersonen (Eltern, Partner:in, etc.) zeigen
created: 2022-09-01
alternative label: Verhalten in engen Beziehungen
top concept of: Klarsaurus
in scheme: Klarsaurus
preferred label: Attachment Behavior @en

Klarsaurus
type: ConceptScheme
has top concept: Bindungsverhalten