Klarsaurus
type: ConceptScheme
has top concept: Xenophilie

Xenophilie
type: Concept
created: 2022-09-01
alternative label: Aufgeschlossenheit gegenüber Fremdem
definition: Gegenüber Fremdem aufgeschlossen und positiv gestimmt sein
in scheme: Klarsaurus
preferred label: Xenophilia @en
top concept of: Klarsaurus