Klarsaurus
type: ConceptScheme
has top concept: Within-Subjects Design

Within-Subjects Design
type: Concept
created: 2022-09-01
definition: Merkmal einer Studie, die Zusammenhänge oder Unterschiede innerhalb von Personen untersucht (zum Beispiel die Veränderung einer Person über die Zeit) @de
in scheme: Klarsaurus
preferred label: Within-Subjects-Design @de
top concept of: Klarsaurus