Klarsaurus
type: ConceptScheme
has top concept: Behavioral Activation

Behavioral Activation
type: Concept
created: 2022-10-01
definition: Eine Methode der Verhaltenstherapie. Sie wird vor allem bei Menschen mit depressiven Beschwerden angewandt. Die Betroffenen werden darin unterstützt, Aktivitäten in Übereinstimmung mit ihren Werten und Zielen zu planen und durchzuführen. @de
in scheme: Klarsaurus
preferred label: Verhaltensaktivierung @de
top concept of: Klarsaurus