Klarsaurus
type: ConceptScheme
has top concept: Social Skills Training

Social Skills Training
type: Concept
created: 2022-10-01
definition: Wird häufig als Teil eines Therapiekonzeptes zur Behandlung psychischer Störungen eingesetzt, beispielsweise in der Kognitiven Verhaltenstherapie. Mit dem Training sollen Betroffene zum Beispiel lernen, eigene Rechte gegenüber anderen durchzusetzen. @de
in scheme: Klarsaurus
preferred label: Training sozialer Fertigkeiten @de
top concept of: Klarsaurus