Klarsaurus
type: ConceptScheme
has top concept: Protektive Faktoren

Protektive Faktoren
type: Concept
created: 2022-09-01
alternative label: Schutzfaktoren
definition: Schutzfaktoren können dazu beitragen, dass manche Menschen trotz schwieriger Erlebnisse nicht an einer psychischen Störung erkranken. Ein Schutzfaktor ist zum Beispiel eine sichere Bindung zu den Eltern in der Kindheit.
in scheme: Klarsaurus
preferred label: Protective Factors @en
top concept of: Klarsaurus