Klarsaurus
type: ConceptScheme
has top concept: Neurotizismus

Neurotizismus
type: Concept
created: 2022-09-01
alternative label: Neigung zu Ängstlichkeit und Stimmungsschwankungen
definition: Einer von fünf grundlegenden Persönlichkeitsfaktoren, die jeder Mensch hat, die aber bei jedem Menschen unterschiedlich ausgeprägt sind
in scheme: Klarsaurus
preferred label: Neuroticism @en
top concept of: Klarsaurus