Klarsaurus
type: ConceptScheme
has top concept: Moderator

Moderator
type: Concept
created: 2022-10-01
definition: Bezeichnet ein Merkmal, dass sich auf den Zusammenhang zwischen zwei anderen Merkmalen auswirkt (z.B. wenn sich körperlicher Fitness auf den Zusammenhang von Alter und Zufriedenheit auswirkt). @de
in scheme: Klarsaurus
top concept of: Klarsaurus