Klarsaurus
type: ConceptScheme
has top concept: Interpersonal Psychology

Interpersonal Psychology
type: Concept
created: 2022-10-01
definition: Ein besonders kurzes Verfahren speziell für die Behandlung von Depressionen und Essstörungen. Hierbei stehen Beziehungen zu anderen Menschen und das eigene Verhalten im Austausch mit anderen Menschen im Fokus. Das Ziel ist es, die Symptome zu verringern und Ursachen und Auslöser von Stress im Alltag zu bewältigen. @de
in scheme: Klarsaurus
preferred label: Interpersonelle Psychotherapie @de
top concept of: Klarsaurus