Klarsaurus
type: ConceptScheme
has top concept: Bindungsverhalten

Bindungsverhalten
type: Concept
created: 2022-09-01
alternative label: Verhalten in engen Beziehungen
definition: Beobachtbares Verhalten, das Menschen im Kontakt mit wichtigen Bezugspersonen (Eltern, Partner:in, etc.) zeigen
in scheme: Klarsaurus
preferred label: Attachment Behavior @en
top concept of: Klarsaurus