Types of Issuance for publications (instances)
preferred label: Erscheinungsformen von Publikationen (Instanzen) @de
type: ConceptScheme

book/media set
created: 2024-03-06
broader: multipart unit
alternative label: multivolume book
alternative label: book set
alternative label: mehrbändiges Buch @de
alternative label: Buchset @de
scope note: Use for things that are issued together and that can be used alone, but are not sold separately, like a book in multiple volumes (like multivolume encyclopedias); that are published at once, not over time), a set of DVDs from a conference that each have a recording from some talk.
notation: 2110
in scheme: Types of Issuance for publications (instances)
preferred label: Buch-/Medienset @de
type: Concept

multipart unit
notation: 2100
preferred label: mehrteilige Einheit @de
type: Concept
narrower: book/media set

PsyndexLit publication types
preferred label: PSYNDEXLit-Publikationstypen @de
type: Collection
member: book/media set