Types of Issuance for publications (instances)
preferred label: Erscheinungsformen von Publikationen (Instanzen) @de
type: ConceptScheme

edited book
created: 2024-03-06
broader: book
alternative label: edited volume
alternative label: Monograph (edited)
alternative label: Sammelwerk @de
alternative label: SS @de
scope note: Commercially published things whose parts may be described separately in PSYNDEX - Monographs with component parts. Books, dissertations made up of parts written by different authors (only if published commercially with an ISBN). Examples: cumulative dissertations, conference proceedings (Tagungsband), Festschrift. Maps to BE=SS
notation: 1212
in scheme: Types of Issuance for publications (instances)
preferred label: selbständiges Sammelwerk (SS) @de
type: Concept

book
notation: 1210
preferred label: Buch @de
type: Concept
narrower: edited book

PSYNDEX Tests publication types
preferred label: PSYNDEX-Tests-Publikationstypen @de
type: Collection
member: edited book

PsyndexLit publication types
preferred label: PSYNDEXLit-Publikationstypen @de
type: Collection
member: edited book