Types of Issuance for publications (instances)
type: ConceptScheme
preferred label: Erscheinungsformen von Publikationen (Instanzen) @de

case, kit, box, or bundle
type: Concept
created: 2024-03-06
editorial note: Maps to bf:Work subclass bf:Kit.
broader: multipart unit
alternative label: test kit
alternative label: file bundle
alternative label: Testkoffer @de
scope note: Für mehrere Gegenstände, die nicht einzeln erhältlich sind, sondern in einer Verpackung oder einem Bündel zusammengefasst. Ein Testkoffer, ein Bündel von pdf-Dateien (Manual, Fragebögen, Auswertungsbögen), ein Kartenset oder Kartenspiel. @de
scope note: Use for sets of multiple things that are issued together, and are not available alone. A test kit or case or a test that is a bundle of pdf files (manual, questionnaires, analysis sheets), a set of cards
notation: 2120
in scheme: Types of Issuance for publications (instances)
preferred label: Koffer, Kasten, Schachtel oder Bündel @de

multipart unit
type: Concept
notation: 2100
preferred label: mehrteilige Einheit @de
narrower: case, kit, box, or bundle

PSYNDEX Tests publication types
type: Collection
preferred label: PSYNDEX-Tests-Publikationstypen @de
member: case, kit, box, or bundle

PsyndexLit publication types
type: Collection
preferred label: PSYNDEXLit-Publikationstypen @de
member: case, kit, box, or bundle