Types of Issuance for publications (instances)
type: ConceptScheme
preferred label: Erscheinungsformen von Publikationen (Instanzen) @de

authored book
type: Concept
created: 2024-03-06
broader: book
alternative label: Monograph (academic)
alternative label: SM @de
alternative label: Buch (Autorenwerk) @de
scope note: The classic 'Monograph' as used in academia, commercially published with an ISBN. Books or dissertations authored by a single person. Usually the chapter parts are not cataloged or linked separately. Also use for mongraphic dissertations (theses that are not cumulative.) Maps to BE=SM and BE=SH.
notation: 1211
in scheme: Types of Issuance for publications (instances)
preferred label: selbständige Monografie (SM) @de

book
type: Concept
notation: 1210
preferred label: Buch @de
narrower: authored book

PSYNDEX Tests publication types
type: Collection
preferred label: PSYNDEX-Tests-Publikationstypen @de
member: authored book

PsyndexLit publication types
type: Collection
preferred label: PSYNDEXLit-Publikationstypen @de
member: authored book