Erscheinungsformen von Publikationen (Instanzen)
type: ConceptScheme
preferred label: Types of Issuance for publications (instances) @en

unselbständiger Bestandteil
type: Concept
narrower: Anhang
notation: 1100
preferred label: component part (dependent) @en

PSYNDEX-Tests-Publikationstypen
type: Collection
member: Anhang
preferred label: PSYNDEX Tests publication types @en

Anhang
type: Concept
created: 2024-03-06
alternative label: unselbständiger Anhang
alternative label: Beilage
alternative label: Ergänzungsmaterial
broader: unselbständiger Bestandteil
in scheme: Erscheinungsformen von Publikationen (Instanzen)
notation: 1140
preferred label: supplement or appendix @en
scope note: Mostly for Tests/Questionnaires that are avaliable at the end of articles or books or for separate download, but are clearly marked as an additional part of the publication. @en