Erscheinungsformen von Publikationen (Instanzen)
type: ConceptScheme
preferred label: Types of Issuance for publications (instances) @en

graue Literatur (SH, SR)
type: Concept
created: 2024-03-06
alternative label: selbständige Hochschulschrift
alternative label: Report @en
alternative label: selbständiger Report
alternative label: SH
alternative label: SR
broader: selbständige Einheit
in scheme: Erscheinungsformen von Publikationen (Instanzen)
notation: 1220
preferred label: gray literature @en
scope note: For standalone textual publications _not_ published by a commercial publisher, but by an institution or person, and that usually have no ISBN. Maps to BE=SR, BE=SH, DT=Report, DRO type 'report', 'preprint'. Examples: Preprints in a repository, the PSYNDEX Selection criteria, research/project reports, institutional or government reports, a test made available as a pdf download by the author, a dissertation only available from an institutional or other repository, fanzines, brochures. @en

PSYNDEXLit-Publikationstypen
type: Collection
member: graue Literatur (SH, SR)
preferred label: PsyndexLit publication types @en

PSYNDEX-Tests-Publikationstypen
type: Collection
member: graue Literatur (SH, SR)
preferred label: PSYNDEX Tests publication types @en

selbständige Einheit
type: Concept
narrower: graue Literatur (SH, SR)
notation: 1200
preferred label: standalone (independent) @en