Text
created: 2022-12-13
scope note: Für geschriebene Sprache, die vorwiegend mit dem Auge wahrgenommen und gelesen werden soll - egal, ob gedruckt, handschriftlich, getippt oder digital.
scope note: Written language to be perceived and read visually, no matter whether printed, handwriting, typescript or digital. @en
notation: 1000
top concept of: Content Types für Werke
in scheme: Content Types für Werke
preferred label: text @en
type: Concept

Content Types für PSYNDEX-Werke
preferred label: Content Types for PSYNDEX Works @en
type: Collection
member: Text

Content Types für Werke
preferred label: Content Types for Works @en
type: ConceptScheme
has top concept: Text