Content Types für Werke
preferred label: Content Types for Works @en
type: ConceptScheme

Unbewegtes Bild
created: 2022-12-13
broader: Bild
narrow match: tci
narrow match: http://rdaregistry.info/termList/RDAContentType/1015
scope note: Für unbewegte Bilder (Zeichnung, Foto, Dia, Folien mit vorwiegend bildhaftem Inhalt, Diagramm etc). Entspricht PsychArchives-DRO-Typ 'StillImage'.
scope note: Use for non-moving pictures like drawings, photos, diagrams/charts, photo slides or overhead transparencies that are mainly pictorial @en
notation: 3200
in scheme: Content Types für Werke
preferred label: still image @en
type: Concept

Contenttypes für PsychArchives
preferred label: Content Types for DROs in PsychArchives @en
type: Collection
member: Unbewegtes Bild

Content Types für PSYNDEX-Werke
preferred label: Content Types for PSYNDEX Works @en
type: Collection
member: Unbewegtes Bild

Bild
notation: 3000
preferred label: image @en
type: HiearchyNode
type: Concept
narrower: Unbewegtes Bild