Content Types für Werke
preferred label: Content Types for Works @en
type: ConceptScheme

Gesprochene Sprache
broader: Nichtmusikalischer Ton
scope note: Audible content in spoken language. Includes recorded lectures, speeches, interviews, panel discussions or readings, radio broadcasts, podcasts, audiobooks and radio plays. Equivalent to former BEs: AS and AU, and DT: Sound @en
scope note: Hörbarer Inhalt in gesprochender Sprache: aufgenommene Vorträge, Reden, Interviews, Podiumsdiskussionen oder Lesungen, Hörfunkbeiträge, Podcasts, Hörbücher und Hörspiele. Entspricht früherem BE AS, AU und DTs Sound
notation: 2110
in scheme: Content Types für Werke
preferred label: spoken word @en
type: Concept

Content Types für PSYNDEX-Werke
preferred label: Content Types for PSYNDEX Works @en
type: Collection
member: Gesprochene Sprache

Nichtmusikalischer Ton
notation: 2100
preferred label: non-music audio @en
type: Concept
narrower: Gesprochene Sprache