Content Types für Werke
preferred label: Content Types for Works @en
type: ConceptScheme

Geräusche
broader: Nichtmusikalischer Ton
scope note: Hörbarer Inhalt, der weder gesprochene Sprache noch Musik ist.
scope note: Audible content that is neither spoken language nor music. @en
notation: 2120
in scheme: Content Types für Werke
preferred label: sounds @en
type: Concept

Nichtmusikalischer Ton
notation: 2100
preferred label: non-music audio @en
type: Concept
narrower: Geräusche