Content Types für Werke
preferred label: Content Types for Works @en
type: ConceptScheme

Computersoftware
created: 2022-12-13
broader: Computer
narrower: Code
scope note: Für Quellcode, Anwendungsprogramme, digital durchführbare Testverfahren (auch wenn online im Browser auszuführen). Digital kodierte Anweisungen, konzipiert für Verarbeitung und Ausführung mit Computern.
scope note: For source code, applications, digital test instrument as applications (also web apps/services). @en
notation: 4200
in scheme: Content Types für Werke
preferred label: computer software @en
type: Concept

Code
notation: 4210
preferred label: code @en
type: Concept
broader: Computersoftware

Computer
notation: 4000
preferred label: computer @en
type: Concept
narrower: Computersoftware