Content Types für Werke
preferred label: Content Types for Works @en
type: ConceptScheme

Musik
created: 2022-12-13
broader: Ton (allgemein)
alternative label: Audio (Musik)
scope note: Für Audio-Inhalt, der nur aus aufgeführter oder gespielter Musik besteht.
scope note: For audible music (as opposed to musical notation in notes on paper or digital documents). @en
notation: 2200
in scheme: Content Types für Werke
preferred label: performed music @en
type: Concept

Ton (allgemein)
notation: 2000
preferred label: audio @en
type: Concept
narrower: Musik