Content Types für Werke
preferred label: Content Types for Works @en
type: ConceptScheme

Bewegtes Bild
created: 2022-12-13
broader: Bild
alternative label: Video
alternative label: video @en
narrow match: tdm
narrow match: tdi
narrow match: http://rdaregistry.info/termList/RDAContentType/1022
narrow match: http://rdaregistry.info/termList/RDAContentType/1023
scope note: Für Bilder, die als Bewegung wahrgenommen werden sollen: Filme (sowohl direkt gefilmt als auch Animationen), Videoaufnahmen von Veranstaltungen, Reden, Aufführungen, etc. Entspricht PsychArchives-DRO-Typ 'MovingImage'.
scope note: Use for images intended to be perceived as moving, including motion pictures (using liveaction and/or animation), video recordings of performances, events,etc. @en
notation: 3100
in scheme: Content Types für Werke
preferred label: moving image @en
type: Concept

Contenttypes für PsychArchives
preferred label: Content Types for DROs in PsychArchives @en
type: Collection
member: Bewegtes Bild

Content Types für PSYNDEX-Werke
preferred label: Content Types for PSYNDEX Works @en
type: Collection
member: Bewegtes Bild

Bild
notation: 3000
preferred label: image @en
type: HiearchyNode
type: Concept
narrower: Bewegtes Bild