Content Types für Werke
preferred label: Content Types for Works @en
type: ConceptScheme

Computerdaten
created: 2022-12-13
broader: Computer
scope note: Digital kodiertes Daten-Set, das für die Verarbeitung durch einen Computer konzipiert ist und meist nicht direkt von Menschen gelesen wird.
scope note: Digital data expressed in a tabular or similar form, to be processed or analyzed by a computer; not usually for direct human consumption. @en
notation: 4100
in scheme: Content Types für Werke
preferred label: computer dataset @en
type: Concept

Contenttypes für PsychArchives
preferred label: Content Types for DROs in PsychArchives @en
type: Collection
member: Computerdaten

Computer
notation: 4000
preferred label: computer @en
type: Concept
narrower: Computerdaten