Content Types für Werke
preferred label: Content Types for Works @en
type: ConceptScheme

Code
broader: Computersoftware
scope note: Für Quellcode, also Skripte/unkompilierte Software, üblicherweise benutzt für Analysecode, der zur Verarbeitung von Forschungsdaten verwendet wird oder wurde.
scope note: For source code, that is: scripts/uncompiled software, usually used as analytic code to analyze research data. @en
notation: 4210
in scheme: Content Types für Werke
preferred label: code @en
type: Concept

Contenttypes für PsychArchives
preferred label: Content Types for DROs in PsychArchives @en
type: Collection
member: Code

Computersoftware
notation: 4200
preferred label: computer software @en
type: Concept
narrower: Code