Dreidimensionale Form
broad match: tdf
broad match: http://rdaregistry.info/termList/RDAContentType/1021
scope note: Für dreidimensionale Gegenstände, die durch Sehen oder Anfassen wahrgenommen werden, wie Testapparate, Spielzeuge etc.
scope note: For 3D objects to be perceived visually or by touch, such as test aparrati, toys, models etc. @en
notation: 5000
top concept of: Content Types für Werke
in scheme: Content Types für Werke
preferred label: 3D form @en
type: Concept

Content Types für PSYNDEX-Werke
preferred label: Content Types for PSYNDEX Works @en
type: Collection
member: Dreidimensionale Form

Content Types für Werke
preferred label: Content Types for Works @en
type: ConceptScheme
has top concept: Dreidimensionale Form