PSYNDEX-Inhaltsklassifikation
type: ConceptScheme
preferred label: PSYNDEX Content Classification Categories @en

Geschichte und theoretische Systeme
type: Concept
modified: 2024-02-27
broader: Allgemeines
scope note: enthält Beiträge zur Geschichte der Psychologie als Ganzes und zu umfassenden theoretischen Systemen, Strömungen und geistigen Schulen; biographische Studien über bekannte Vertreterinnen und Vertreter der Psychologie sowie Nachrufe. Beachte: Theoretische Arbeiten und Texte zur Geschichte spezieller Gebiete der Psychologie werden unter der spezifischen Kategorie klassifiziert. Beispiel: Die Geschichte der Marktpsychologie wird unter 3900 (Marktpsychologie) klassifiziert.
notation: 2140
in scheme: PSYNDEX-Inhaltsklassifikation
preferred label: History & Systems @en

Allgemeines
type: Concept
notation: 2100
preferred label: General Psychology @en
narrower: Geschichte und theoretische Systeme

alle SH-Klassifikationen
type: Collection
preferred label: All SH Classifications @en
member: Geschichte und theoretische Systeme