Additional Terms (IT)
preferred label: Zusatzdeskriptoren (IT) @de
type: ConceptScheme

Test Theory
deprecated: true
is replaced by: https://w3id.org/zpid/vocabs/terms/09335
is replaced by: https://w3id.org/zpid/vocabs/terms/26825
broad match: https://w3id.org/zpid/vocabs/terms/09335
broad match: https://w3id.org/zpid/vocabs/terms/26825
history note: Bis 2021; IT wurde deaktiviert, da im Thesaurus jetzt die CTs Classical Test Theory und Item Response Theory zur Verfügung stehen. Allerdings wurde der IT nicht in den Records ersetzt (es sind also noch ältere Nachweise mit IT=Test Theory verschlagwortet, aber für neue wird er nicht mehr verwendet), da nicht entschieden werden konnte, ob der IT durch den CT Classical Test Theory oder den CT Item Response Theorie ersetzt werden soll.
modified: 2021-01-01
created: 1979-01-01
broader: https://w3id.org/zpid/vocabs/terms/09335
broader: https://w3id.org/zpid/vocabs/terms/26825
scope note: Theoretical foundations underlying the construction and analysis of psychological tests.
scope note: Die theoretischen Voraussetzungen der Konstruktion und Analyse psychologischer Tests. @de
in scheme: Additional Terms (IT)
preferred label: Testtheorie @de
type: Concept

Methodology
preferred label: Methodik @de
type: Collection
member: Test Theory