Subjective Theories
scope note: Subjective models or concepts concerning aspects of subjectively perceived phenomena and their impact on behavior and acting. Research topics include clients’ subjective theories about their illness and their therapists’ or teachers’ subjective theories about students with a strong orientation toward qualitative research methods.
scope note: Subjektive Denkmodelle oder Konzepte (Alltagswissen) über einen bestimmten Ausschnitt der wahrgenommenen Welt oder deren Auswirkungen auf Verhalten bzw. Handeln; Forschungsbeispiele sind etwa die subjektiven Theorien von Patienten über ihre Krankheit oder ihre Therapie sowie die von Lehrern über ihre Schüler; in methodischer Hinsicht in der Regel Orientierung an qualitativen Methoden. @de
top concept of: Additional Terms (IT)
in scheme: Additional Terms (IT)
preferred label: Subjektive Theorien @de
type: Concept

Personality and Social Psychology
preferred label: Persönlichkeits- und Sozialpsychologie @de
type: Collection
member: Subjective Theories

Additional Terms (IT)
preferred label: Zusatzdeskriptoren (IT) @de
type: ConceptScheme
has top concept: Subjective Theories