Psychology of Expression
scope note: Study of body expressions relevant in the history of psychology in the German-speaking countries which deals with expressive phenomena and their psychological significance, and is closely related to traditional concepts in psychodiagnosis/forensic evaluation and personality theory. Analysis includes facial expressions, gestures, motor processes, speech characteristics, and handwriting.
scope note: Aus der geisteswissenschaftlichen Tradition entwickelte und im deutschen Sprachraum psychologiegeschichtlich relevante Lehre vom körperlichen Ausdruck, seinen Erscheinungsformen und seiner psychologischen Bedeutung; eng zusammenhängend mit Psychodiagnostik/Forensischer Begutachtung und Persönlichkeitskunde; umfasst verschiedene Ausdrucksgebiete, etwa Mimik, Gestik, Motorik, Ausdrucksgehalt von Stimme und Sprechweise, Handschrift. @de
top concept of: Additional Terms (IT)
in scheme: Additional Terms (IT)
preferred label: Ausdruckspsychologie @de
type: Concept

Theories
preferred label: Theorien @de
type: Collection
member: Psychology of Expression

Additional Terms (IT)
preferred label: Zusatzdeskriptoren (IT) @de
type: ConceptScheme
has top concept: Psychology of Expression