New German States
scope note: Eastern German states. Used when referring to psychological or psychosocial factors currently affecting the citizens of these states or which affected the citizens of the former German Democratic Republic during the process of German unification beginning in 1990.
scope note: Ostdeutsche Bundesländer; wird vergeben, wenn psychologische oder psychosoziale Faktoren behandelt werden, die im Prozess der deutschen Vereinigung (seit 1990) von Bedeutung sind oder die Menschen in diesen Ländern in besonderer Form betreffen. @de
top concept of: Additional Terms (IT)
in scheme: Additional Terms (IT)
preferred label: Neue Bundesländer @de
type: Concept

Politics, Society, Work
preferred label: Politik, Gesellschaft, Arbeit @de
type: Collection
member: New German States

Additional Terms (IT)
preferred label: Zusatzdeskriptoren (IT) @de
type: ConceptScheme
has top concept: New German States