Heimerziehung
related: https://w3id.org/zpid/vocabs/terms/44080
related match: https://w3id.org/zpid/vocabs/terms/44080
scope note: Residential care education for children and adolescents with special needs (e.g., behavior disorders, developmental deficits, orphans).
scope note: Institutionelle Form der außerfamiliären Erziehung für Kinder und Jugendliche mit besonderem Förderungsbedarf (etwa bei Verhaltensstörungen, psychischen Fehlentwicklungen, Waisen). @de
top concept of: Additional Terms (IT)
in scheme: Additional Terms (IT)
type: Concept

Education
preferred label: Bildung und Erziehung @de
type: Collection
member: Heimerziehung

Additional Terms (IT)
preferred label: Zusatzdeskriptoren (IT) @de
type: ConceptScheme
has top concept: Heimerziehung