Dynamic Psychiatry
scope note: Psychiatric school founded by G. Ammon which considers mental disorders as defective ego structures and the development of identity as the goal of treatment. The approach is based on psychoanalysis, traditional psychiatry, and group dynamics.
scope note: Eine von G. Ammon begründete psychiatrische Richtung, die psychische Störungen auf der Grundlage eines humanstrukturell-sozialenergetischen Modells als defizitäre Ich-Strukturen auffasst und eine nachholende Identitätsentwicklung anstrebt. Der Ansatz berücksichtigt Erkenntnisse von Psychoanalyse, klassischer Psychiatrie und Gruppendynamik. @de
top concept of: Additional Terms (IT)
in scheme: Additional Terms (IT)
preferred label: Dynamische Psychiatrie @de
type: Concept

Clinical Psychology
preferred label: Klinische Psychologie @de
type: Collection
member: Dynamic Psychiatry

Additional Terms (IT)
preferred label: Zusatzdeskriptoren (IT) @de
type: ConceptScheme
has top concept: Dynamic Psychiatry