Critical Psychology
scope note: School of psychology based on dialectic materialism and Marxism developed by K. Holzkamp as an alternative to bourgeois mainstream psychology in the context of student activism, and focusing on social determinants of subjectivity with the aim of emancipating both individuals and society.
scope note: Eine am Dialektischen Materialismus bzw. am Marxismus orientierte und als Alternative zur 'bürgerlichen Psychologie' aufgefasste psychologische Schule, die im Kontext der Studentenwegung von K. Holzkamp entwickelt wurde; sie hebt die gesellschaftlichen Determinanten von Subjektivität sowie die Emanzipation des Einzelnen und der Gesellschaft besonders hervor. @de
top concept of: Additional Terms (IT)
in scheme: Additional Terms (IT)
preferred label: Kritische Psychologie @de
type: Concept

Theories
preferred label: Theorien @de
type: Collection
member: Critical Psychology

Additional Terms (IT)
preferred label: Zusatzdeskriptoren (IT) @de
type: ConceptScheme
has top concept: Critical Psychology