Academic Examination
broad match: https://w3id.org/zpid/vocabs/terms/16140
broader: https://w3id.org/zpid/vocabs/terms/16140
scope note: Achievement control in schools or colleges.
scope note: Jegliche Form von Leistungskontrolle in Schule oder Hochschule. @de
top concept of: Additional Terms (IT)
in scheme: Additional Terms (IT)
preferred label: Prüfung (Schule und Hochschule) @de
type: Concept

Education
preferred label: Bildung und Erziehung @de
type: Collection
member: Academic Examination

Additional Terms (IT)
preferred label: Zusatzdeskriptoren (IT) @de
type: ConceptScheme
has top concept: Academic Examination