Zivildienst
type: Concept
related: Conscientious Objection
scope note: Community service provided by conscientious objectors in social institutions in lieu of military service.
scope note: Ein von Wehrdienstverweigerern in sozialen Einrichtungen geleisteter Dienst als Ersatz für den Wehrdienst. @de
top concept of: Additional Terms (IT)
in scheme: Additional Terms (IT)

Conscientious Objection
type: Concept
preferred label: Kriegsdienstverweigerung @de
related: Zivildienst

Politics, Society, Work
type: Collection
preferred label: Politik, Gesellschaft, Arbeit @de
member: Zivildienst

Additional Terms (IT)
type: ConceptScheme
preferred label: Zusatzdeskriptoren (IT) @de
has top concept: Zivildienst