Surprise
type: Concept
broad match: https://w3id.org/zpid/vocabs/terms/16900
broader: https://w3id.org/zpid/vocabs/terms/16900
scope note: Emotional and cognitive reactions to the occurrence of unexpected events.
scope note: Emotionale und kognitive Reaktionen beim Eintreten von erwartungswidrigen Ereignissen. @de
top concept of: Additional Terms (IT)
in scheme: Additional Terms (IT)
preferred label: Überraschung @de

General Psychology
type: Collection
preferred label: Allgemeine Psychologie @de
member: Surprise

Additional Terms (IT)
type: ConceptScheme
preferred label: Zusatzdeskriptoren (IT) @de
has top concept: Surprise