Situation
type: Concept
scope note: Concept developed in the context of the interactionist position concerning the problem of individual consistency in personality psychology. Used when situational determinants of individual experience and behavior are central and when the concept of situation is explicitly used.
scope note: Wird indexiert, wenn situationale Determinanten von individuellem Erleben und Verhalten unter expliziter Bezugnahme auf den Situationsbegriff zentral sind; entwickelt im Rahmen der interaktionistischen Position in bezug auf die Konsistenzproblematik in der Persönlichkeitspsychologie. @de
top concept of: Additional Terms (IT)
in scheme: Additional Terms (IT)

Theories
type: Collection
preferred label: Theorien @de
member: Situation

Additional Terms (IT)
type: ConceptScheme
preferred label: Zusatzdeskriptoren (IT) @de
has top concept: Situation