Salutogenesis
type: Concept
scope note: Holistic health-psychological approach according to A. Antonovsky focusing on the question of health-maintaining factors and resources.
scope note: Ganzheitliches gesundheitspsychologisches Konzept nach A. Antonovsky, das die Frage nach den die Gesundheit erhaltenden Faktoren und den dabei bedeutsamen Ressourcen fokussiert. @de
top concept of: Additional Terms (IT)
in scheme: Additional Terms (IT)
preferred label: Salutogenese @de

Clinical Psychology
type: Collection
preferred label: Klinische Psychologie @de
member: Salutogenesis

Additional Terms (IT)
type: ConceptScheme
preferred label: Zusatzdeskriptoren (IT) @de
has top concept: Salutogenesis