Politeness
type: Concept
broad match: https://w3id.org/zpid/vocabs/terms/41133
related: https://w3id.org/zpid/vocabs/terms/61676
related match: https://w3id.org/zpid/vocabs/terms/61676
broader: https://w3id.org/zpid/vocabs/terms/41133
scope note: Used when politeness in interpersonal communication is a central topic and to analyze social values related to politeness or forms and functions of polite behavior in interpersonal communication in dyads, groups, and organizations.
scope note: Wird indexiert, wenn die Analyse des höflichen interpersonalen Verhaltens im Mittelpunkt steht; analysiert werden beispielsweise die sozialen Vorstellungen davon, was Höflichkeit ist, sowie Formen und Funktionen von Höflichkeit in der interpersonellen Kommunikation in Dyaden, Gruppen und Organisationen. @de
top concept of: Additional Terms (IT)
in scheme: Additional Terms (IT)
preferred label: Höflichkeit @de

Personality and Social Psychology
type: Collection
preferred label: Persönlichkeits- und Sozialpsychologie @de
member: Politeness

Additional Terms (IT)
type: ConceptScheme
preferred label: Zusatzdeskriptoren (IT) @de
has top concept: Politeness