Personal Constructs
type: Concept
scope note: Comprehensive personality model with a social-cognitive orientation developed by G. A. Kelly, focusing on the role of personal or subjective assumptions, cognitions, beliefs, and images in individual world view and in subjective experiencing and acting, and connected with specific methodological orientations such as the repertory grid technique. In recent publications frequently applied in the context of psychotherapy research (personal constructs of clients).
scope note: Von G. A. Kelly entwickeltes sozial-kognitiv orientiertes Modell der Persönlichkeit, das die Bedeutung subjektiver Annahmen, Setzungen, Überzeugungen oder Bilder für die individuelle Weltsicht sowie das individuelle Erleben und Handeln thematisiert; verbunden mit bestimmten methodischen Vorstellungen (beispielsweise Repertory Grid-Technik); taucht in neueren Arbeiten häufig im Rahmen der Psychotherapieforschung auf (persönliche Konstrukte von Klienten). @de
top concept of: Additional Terms (IT)
in scheme: Additional Terms (IT)
preferred label: Persönliche Konstrukte @de

Personality and Social Psychology
type: Collection
preferred label: Persönlichkeits- und Sozialpsychologie @de
member: Personal Constructs

Additional Terms (IT)
type: ConceptScheme
preferred label: Zusatzdeskriptoren (IT) @de
has top concept: Personal Constructs