Mediators (Therapy)
type: Concept
history note: Changed German wording for appropriate gendering in prefLabel and scopeNote in early 2023
modified: 2023-03-08
scope note: Persons such as teachers or other educational personnel, parents, or family members involved in therapeutic interventions, usually under the supervision of professional therapists.
scope note: Personen, die im Auftrag bzw. unter Anleitung von professionellen Therapeutinnen und Therapeuten Interventionsmaßnahmen bei Klientinnen und Klienten durchführen (etwa bei Lehrkräften und Erziehungspersonal, Eltern, Angehörigen). @de
top concept of: Additional Terms (IT)
in scheme: Additional Terms (IT)
preferred label: Mediatorinnen und Mediatoren (Therapie) @de

Clinical Psychology
type: Collection
preferred label: Klinische Psychologie @de
member: Mediators (Therapy)

Additional Terms (IT)
type: ConceptScheme
preferred label: Zusatzdeskriptoren (IT) @de
has top concept: Mediators (Therapy)