Measurement of Change
type: Concept
scope note: Psychometric and statistical methodology for the analysis of temporal changes in individuals and groups, in particular in therapy research.
scope note: Psychometrische und statistische Untersuchungsmethodik zur Analyse der Veränderung von Individuen und Gruppen über die Zeit. Vor allem in der Therapieforschung eingesetzt. @de
top concept of: Additional Terms (IT)
in scheme: Additional Terms (IT)
preferred label: Veränderungsmessung @de

Methodology
type: Collection
preferred label: Methodik @de
member: Measurement of Change

Additional Terms (IT)
type: ConceptScheme
preferred label: Zusatzdeskriptoren (IT) @de
has top concept: Measurement of Change