Learning Tests
type: Concept
scope note: A dynamic approach to psychological testing in which learning processes during the testing procedure have an important diagnostic value.
scope note: Ein Ansatz psychologischen Testens, der sich nicht auf die statische Erfassung von Merkmalen beschränkt, sondern Lernprozesse während der Testprozedur berücksichtigt und in die Interpretation einbezieht. @de
top concept of: Additional Terms (IT)
in scheme: Additional Terms (IT)
preferred label: Lerntests @de

Methodology
type: Collection
preferred label: Methodik @de
member: Learning Tests

Additional Terms (IT)
type: ConceptScheme
preferred label: Zusatzdeskriptoren (IT) @de
has top concept: Learning Tests