Embodiment
type: Concept
created: 2023-03-08
scope note: Embodiment is a broad term in psychology in the context of the connection between body and soul. In a broader sense it refers to the interaction between psychological and bodily processes and in a narrower sense it emphasizes a stronger consideration of the body in the analysis of psychological processes and phenomena.
scope note: Embodiment ist in der Psychologie ein weit gefasster Begriff im Kontext des Zusammenhangs von Leib und Seele. Er bezieht sich im weiteren Sinne auf die Wechselwirkung zwischen psychischen und körperlichen Prozessen und betont im engeren Sinne eine stärkere Berücksichtigung des Körpers in der Analyse psychologischer Prozesse und Phänomene. @de
top concept of: Additional Terms (IT)
in scheme: Additional Terms (IT)
preferred label: Verkörperung @de

Theories
type: Collection
preferred label: Theorien @de
member: Embodiment

Additional Terms (IT)
type: ConceptScheme
preferred label: Zusatzdeskriptoren (IT) @de
has top concept: Embodiment