Didactics of Graduate Education
type: Concept
related: https://w3id.org/zpid/vocabs/terms/22960
related match: https://w3id.org/zpid/vocabs/terms/22960
scope note: Models and methodology of teaching in graduate education.
scope note: Modelle und Methodik der Lehrstoffvermittlung im universitären Bereich. @de
top concept of: Additional Terms (IT)
in scheme: Additional Terms (IT)
preferred label: Hochschuldidaktik @de

Education
type: Collection
preferred label: Bildung und Erziehung @de
member: Didactics of Graduate Education

Additional Terms (IT)
type: ConceptScheme
preferred label: Zusatzdeskriptoren (IT) @de
has top concept: Didactics of Graduate Education