Balint Groups
type: Concept
scope note: Type of supervision and inservice training for physicians and mental health personnel founded by the Hungarian psychoanalyst M. Balint. A major topic of these groups is therapist-client relations.
scope note: Eine auf den Psychoanalytiker M. Balint zurückgehende Form der Supervision und Fortbildung für Ärzte und Angehörige psychosozialer Berufsgruppen, in der Fälle aus der Berufspraxis diskutiert werden. Ein zentrales Thema dieser Gruppen ist die Klient-Therapeut-Beziehung. @de
top concept of: Additional Terms (IT)
in scheme: Additional Terms (IT)
preferred label: Balint-Gruppen @de

Clinical Psychology
type: Collection
preferred label: Klinische Psychologie @de
member: Balint Groups

Additional Terms (IT)
type: ConceptScheme
preferred label: Zusatzdeskriptoren (IT) @de
has top concept: Balint Groups